"primaryid","caseid","i_f_code","i_f_code_num","foll_seq","image","event_dt","event_dt_num","mfr_dt","mfr_dt_num","fda_dt","fda_dt_num","rept_cod","rept_cod_num","mfr_num","mfr_sndr","age","age_cod","sex","e_sub","wt","wt_cod","rept_dt","rept_dt_num","occp_cod","death_dt","to_mfr","confid","occp_cod_num"
4391150,4017389,"F",70,,"4391150-7",19990101,1/1/1999,20031014,10/14/2003,20040707,7/7/2004,"EXP",698880,"JP-BRISTOL-MYERS SQUIBB COMPANY-12415378","BRISTOL-MYERS SQUIBB COMPANY",32,"YR","M","Y",,,20040707,7/7/2004,"OT",,,,7984
4392607,4167524,"F",70,"1","4392607-5",,,20040618,6/18/2004,20040702,7/2/2004,"EXP",698880,"2004-BP-03764RP","B.I. (PHIL) INC.",84,"YR","F","N",,,20040629,6/29/2004,"OT",,,,7984
4393926,4163963,"F",70,"1","4393926-9",20020101,1/1/2002,20040621,6/21/2004,20040702,7/2/2004,"EXP",698880,"SUSI-2004-00361","SHIRE PHARMACEUTICALS DEVELOPMENT INC.",9,"YR","M","N",,,20040630,6/30/2004,"MD",,,,7768
4397544,5747168,"I",72,,"4397544-8",,,20040623,6/23/2004,20040708,7/8/2004,"EXP",698880,"2004-DE-03479GD","ROXANE LABORATORIES, INC.",,,"F","N",,,20040706,7/6/2004,,,,,
4397545,5747274,"I",72,,"4397545-X",,,20040623,6/23/2004,20040708,7/8/2004,"EXP",698880,"2004-DE-03482GD","ROXANE LABORATORIES, INC.",,,"F","N",,,20040706,7/6/2004,,,,,
4409579,4017389,"F",70,,"4409579-7",19990101,1/1/1999,20031014,10/14/2003,20040728,7/28/2004,"EXP",698880,"JP-BRISTOL-MYERS SQUIBB COMPANY-12415378","BRISTOL-MYERS SQUIBB COMPANY",32,"YR","M","Y",,,20040728,7/28/2004,"OT",,,,7984
4411305,5741865,"I",72,,"4411305-2",20040513,5/13/2004,20040719,7/19/2004,20040727,7/27/2004,"EXP",698880,"HQWYE259120JUL04","WYETH LABS (RA)",65,"YR","M","N",,,20040726,7/26/2004,"OT",,,,7984
4412869,4186209,"I",72,,"4412869-5",20040706,7/6/2004,20040713,7/13/2004,20040727,7/27/2004,"EXP",698880,"2004-BP-05595BP","B.I. PHARMACEUTICALS INC.",8,"YR","F","N",,,20040726,7/26/2004,"PH",,,,8072
4413952,5741866,"I",72,,"4413952-0",20030920,9/20/2003,20040719,7/19/2004,20040729,7/29/2004,"EXP",698880,"HQWYE258320JUL04","WYETH LABS (RA)",31,"YR","M","N",,,20040728,7/28/2004,"OT",,,,7984
4416911,5735725,"I",72,,"4416911-7",,,20040721,7/21/2004,20040802,8/2/2004,"EXP",698880,"SUS1-2004-00424","SHIRE PHARMACEUTICAL DEVELOPMENT INC.",22,"YR","M","N",,,20040729,7/29/2004,"MD",,,,7768
4424101,4188865,"F",70,"1","4424101-7",20020115,1/15/2002,20040729,7/29/2004,20040809,8/9/2004,"EXP",698880,"2004-07-1190","SCHERING-PLOUGH CORPORATION",6,"YR","M","N",,,20040729,7/29/2004,"OT",20020124,,,7984
4425417,5744127,"I",72,,"4425417-0",20040416,4/16/2004,20040810,8/10/2004,20040813,8/13/2004,"EXP",698880,"FR-GLAXOSMITHKLINE-B0342124A","GLAXOSMITHKLINE",70,"YR","M","Y",,,20040813,8/13/2004,"CN",,,,6778
4427650,5735726,"I",72,,"4427650-0",20040701,7/1/2004,20040803,8/3/2004,20040812,8/12/2004,"EXP",698880,"SUS1-2004-00440","SHIRE PHARMACEUTICAL DEVELOPMENT INC.",27,"YR","F","N",53.5,"KG",20040811,8/11/2004,"OT",,,,7984
4428107,4206389,"I",72,,"4428107-3",20030807,8/7/2003,20040331,3/31/2004,20040726,7/26/2004,"PER",806982,"USA030843650","ELI LILLY AND COMPANY",67,"YR","F","N",43,"KG",20040607,6/7/2004,"CN",,,,6778
4428296,5744165,"I",72,,"4428296-0",20040512,5/12/2004,,,20040818,8/18/2004,"DIR",687382,,,87,"YR","F","N",61.2999992370605,"KG",20040817,8/17/2004,"PH",,"N","Y",8072
4429224,5744166,"I",72,,"4429224-4",20040813,8/13/2004,,,20040819,8/19/2004,"DIR",687382,,,44,"YR","F","N",124,"LBS",20040818,8/18/2004,"CN",,"N","N",6778
4430871,4194946,"I",72,,"4430871-4",20040706,7/6/2004,20040810,8/10/2004,20040823,8/23/2004,"EXP",698880,"FR-GLAXOSMITHKLINE-B0342144A","GLAXOSMITHKLINE",23,"YR","M","Y",60,"KG",20040823,8/23/2004,"CN",,,,6778
4431168,5735727,"I",72,,"4431168-9",20040806,8/6/2004,20040810,8/10/2004,20040818,8/18/2004,"EXP",698880,"SUS1-2004-00463","SHIRE PHARMACEUTICAL DEVELOPMENT INC.",28,"YR","M","N",83.9000015258789,"KG",20040813,8/13/2004,"CN",,,,6778
4432972,5754354,"I",72,,"4432972-3",,,20040810,8/10/2004,20040823,8/23/2004,"EXP",698880,"2004228915US","PFIZER INC.",,,"F","N",,,20040819,8/19/2004,"LW",,,,7687
4434417,4168964,"F",70,"1","4434417-6",20040510,5/10/2004,20040810,8/10/2004,20040825,8/25/2004,"EXP",698880,"USA040567362","ELI LILLY AND COMPANY",45,"YR","F","N",56,"KG",20040818,8/18/2004,"OT",20040510,,,7984
4435901,5763145,"I",72,,"4435901-1",20040803,8/3/2004,20040818,8/18/2004,20040826,8/26/2004,"EXP",698880,"2004228978US","PFIZER INC.",,,"M","N",,,20040824,8/24/2004,"OT",,,,7984
4437102,5754355,"I",72,,"4437102-X",,,20040824,8/24/2004,20040830,8/30/2004,"EXP",698880,"PHEH2004US09167","NOVARTIS PHARMACEUTICALS CORP.",,,"F","Y",,,20040830,8/30/2004,"LW",,,,7687
4437630,4199968,"I",72,,"4437630-7",20040624,6/24/2004,20040820,8/20/2004,20040831,8/31/2004,"EXP",698880,"JP-JNJFOC-20040806612","JOHNSON + JOHNSON PHARMACEUTICAL",35,"YR","F","Y",,,20040831,8/31/2004,"MD",,,,7768
4437641,4204033,"I",72,,"4437641-1",20040806,8/6/2004,20040816,8/16/2004,20040827,8/27/2004,"EXP",698880,"2004056929","WWS PFIZER INC",62,"YR","F","N",,,20040826,8/26/2004,"MD",,,,7768
4439966,5744080,"I",72,,"4439966-2",20040714,7/14/2004,20040825,8/25/2004,20040902,9/2/2004,"EXP",698880,"JP-JNJFOC-20040808004","JOHNSON + JOHNSON PHARMACEUTICAL",49,"YR","F","Y",,,20040902,9/2/2004,"MD",,,,7768
4440838,4194946,"F",70,,"4440838-8",20040706,7/6/2004,20040810,8/10/2004,20040903,9/3/2004,"EXP",698880,"FR-GLAXOSMITHKLINE-B0342144A","GLAXOSMITHKLINE",13,"YR","M","Y",60,"KG",20040903,9/3/2004,"CN",,,,6778
4440840,5741907,"I",72,,"4440840-6",20040701,7/1/2004,20040823,8/23/2004,20040903,9/3/2004,"EXP",698880,"FR-GLAXOSMITHKLINE-B0343362A","GLAXOSMITHKLINE",72,"YR","F","Y",60,"KG",20040903,9/3/2004,"CN",,,,6778
4441586,5664215,"I",72,,"4441586-0",,,20040319,3/19/2004,20040728,7/28/2004,"PER",806982,"USA040361534","ELI LILLY AND COMPANY",16,"YR","F","N",59,"KG",20040629,6/29/2004,"MD",,,,7768
4446915,5741868,"I",72,,"4446915-X",20040617,6/17/2004,20040820,8/20/2004,20040908,9/8/2004,"EXP",698880,"DSA_24866_2004","BIOVAIL PHARMACEUTICALS INC.",72,"YR","F","N",60,"KG",20040907,9/7/2004,"CN",,,,6778
4448333,4201298,"F",70,"1","4448333-7",20040630,6/30/2004,20040827,8/27/2004,20040909,9/9/2004,"EXP",698880,"2004055469","WWS PFIZER INC",60,"YR","F","N",,,20040907,9/7/2004,"MD",20040712,,,7768
4451332,4220499,"I",72,,"4451332-2",20040630,6/30/2004,20040702,7/2/2004,20040913,9/13/2004,"PER",806982,"2004-BP-05369BP","B. I. PHARMACEUTICALS, INC.",54,"YR","F","N",,,20040813,8/13/2004,"CN",,,,6778
4453249,4220300,"I",72,,"4453249-6",,,20040510,5/10/2004,20040902,9/2/2004,"PER",806982,"200417825BWH","BAYER PHARMACEUTICALS CORPORATION",,,"M","N",,,20040824,8/24/2004,,,,,
4455173,4217448,"I",72,,"4455173-1",,,20040906,9/6/2004,20040917,9/17/2004,"EXP",698880,"DE-2004-031456","BERLEX INC",,,"F","N",,,20040916,9/16/2004,"MD",,,,7768
4456314,4220582,"I",72,,"4456314-2",20040721,7/21/2004,20040722,7/22/2004,20040902,9/2/2004,"PER",806982,"200419313BWH","BAYER PHARMACEUTICALS CORPORATION",,,"M","N",,,20040824,8/24/2004,,,,,
4456340,5754356,"I",72,,"4456340-3",,,20040909,9/9/2004,20040917,9/17/2004,"EXP",698880,"2004232967US","PFIZER INC.",,,"F","N",,,20040915,9/15/2004,"LW",,,,7687
4456876,5750620,"I",72,,"4456876-5",20040101,1/1/2004,20040908,9/8/2004,20040921,9/21/2004,"EXP",698880,"04P-056-0272952-00","PPD PHARMACOVIGILANCE              ABBOTT",78,"YR","F","N",,,20040908,9/8/2004,"OT",,,,7984
4457767,5664479,"I",72,,"4457767-6",20000101,1/1/2000,20030724,7/24/2003,20040917,9/17/2004,"PER",806982,"US-JNJFOC-20030602313","JOHNSON+JOHNSON PHARMACEUTICALS",60,"YR","F","N",126,"LBS",20040831,8/31/2004,,,,,
4457769,4220844,"I",72,,"4457769-X",20030724,7/24/2003,20030731,7/31/2003,20040917,9/17/2004,"PER",806982,"US-JNJFOC-20030601777","JOHSON+JOHNSON PHARMACEUTICALS",56,"YR","M","N",140,"LBS",20040831,8/31/2004,,,,,
4457900,4220955,"I",72,,"4457900-6",20040606,6/6/2004,20040607,6/7/2004,20040917,9/17/2004,"PER",806982,"US-JNJFOC-20040602626","JOHNSON + JOHNSON PHARMACEUTICAL",,,"F","N",,,20040831,8/31/2004,"CN",,,,6778
4457966,4202383,"F",70,"1","4457966-3",20040424,4/24/2004,20040910,9/10/2004,20040922,9/22/2004,"EXP",698880,"04P-087-0270911-00","PPD PHARMACOVIGILANCE",32,"YR","F","N",,,20040910,9/10/2004,"MD",,,,7768
4459648,4220689,"I",72,,"4459648-0",20030811,8/11/2003,20030828,8/28/2003,20040915,9/15/2004,"PER",806982,"2003036642","WWS PFIZER INC",69,"YR","M","N",280,"LBS",20040830,8/30/2004,,,,,
4459649,4220690,"I",72,,"4459649-2",,,20031001,10/1/2003,20040915,9/15/2004,"PER",806982,"2003041492","WWS PFIZER INC",,,"F","N",,,20040830,8/30/2004,"OT",,,,7984
4459650,4220691,"I",72,,"4459650-9",20030101,1/1/2003,20031124,11/24/2003,20040915,9/15/2004,"PER",806982,"2003115018","WWS PFIZER INC",55,"YR","M","N",295,"LBS",20040830,8/30/2004,,,,,
4459654,4220694,"I",72,,"4459654-6",,,20031007,10/7/2003,20040917,9/17/2004,"PER",806982,"20031000085","BAXTER HEALTHCARE CORPORATION",65,"YR","M","N",,,20040818,8/18/2004,"MD",,,,7768
4459655,4220696,"I",72,,"4459655-8",,,20031007,10/7/2003,20040917,9/17/2004,"PER",806982,"20031000086","BAXTER HEALTHCARE CORPORATION",60,"YR","M","N",,,20040818,8/18/2004,"MD",,,,7768
4459656,4220699,"I",72,,"4459656-X",,,20031007,10/7/2003,20040917,9/17/2004,"PER",806982,"20031000087","BAXTER HEALTHCARE CORPORATION",45,"YR","F","N",,,20040818,8/18/2004,"MD",,,,7768
4459657,4220700,"I",72,,"4459657-1",,,20040401,4/1/2004,20040917,9/17/2004,"PER",806982,"20040400284","BAXTER HEALTHCARE CORPORATION",,,"F","N",,,20040818,8/18/2004,"PH",,,,8072
4462992,5740092,"I",72,,"4462992-4",20040706,7/6/2004,20040913,9/13/2004,20040927,9/27/2004,"EXP",698880,"2004-UK-00894UK","BOEHRINGER INGELHEIM LTD./ BRACKNELL",63,"YR","F","N",,,20040924,9/24/2004,"OT",,,,7984
4463646,4218506,"I",72,,"4463646-0",19990101,1/1/1999,20040922,9/22/2004,20041001,10/1/2004,"EXP",698880,"PHNU2004DE03295","NOVARTIS PHARMACEUTICALS CORP.",,,"M","Y",,,20041001,10/1/2004,"MD",,,,7768
4463659,4219757,"I",72,,"4463659-9",20030912,9/12/2003,20040921,9/21/2004,20041001,10/1/2004,"EXP",698880,"GB-JNJFOC-20040908931","CENTOCOR, INC.",,,,"Y",,,20041001,10/1/2004,"MD",20030912,,,7768
4463660,4219758,"I",72,,"4463660-5",20040609,6/9/2004,20040921,9/21/2004,20041001,10/1/2004,"EXP",698880,"GB-JNJFOC-20040908987","CENTOCOR, INC.",,,,"Y",,,20041001,10/1/2004,"MD",20040609,,,7768
4463665,4219763,"I",72,,"4463665-4",20040101,1/1/2004,20040921,9/21/2004,20041001,10/1/2004,"EXP",698880,"BE-JNJFOC-20040903228","CENTOCOR, INC.",20,"YR","F","Y",,,20041001,10/1/2004,"MD",,,,7768
4463666,4219764,"I",72,,"4463666-6",20040101,1/1/2004,20040921,9/21/2004,20041001,10/1/2004,"EXP",698880,"BE-JNJFOC-20040903242","CENTOCOR, INC.",22,"YR","M","Y",,,20041001,10/1/2004,"MD",,,,7768
4463667,4219765,"F",70,,"4463667-8",20040801,8/1/2004,20040921,9/21/2004,20041001,10/1/2004,"EXP",698880,"BE-JNJFOC-20040902958","CENTOCOR, INC.",30,"YR","F","Y",,,20041001,10/1/2004,"MD",,,,7768
4463668,4219766,"I",72,,"4463668-X",20040801,8/1/2004,20040921,9/21/2004,20041001,10/1/2004,"EXP",698880,"ES-JNJFOC-20040907416","CENTOCOR, INC.",35,"YR","M","Y",,,20041001,10/1/2004,"MD",20040101,,,7768
4463669,4219767,"I",72,,"4463669-1",,,20040922,9/22/2004,20041001,10/1/2004,"EXP",698880,"ES-JNJFOC-20040907859","CENTOCOR, INC.",,,"M","Y",,,20041001,10/1/2004,"MD",,,,7768
4463670,4093992,"I",72,,"4463670-8",20031219,12/19/2003,20040927,9/27/2004,20041001,10/1/2004,"PER",806982,"US-JNJFOC-20040201385","CENTOCOR, INC.",,,"M","Y",72.5800018310547,"KG",20041001,10/1/2004,"MD",,,,7768
4463671,4187143,"I",72,,"4463671-X",20040624,6/24/2004,20040921,9/21/2004,20041001,10/1/2004,"EXP",698880,"FR-JNJFOC-20040705089","CENTOCOR, INC.",30,"YR","F","Y",,,20041001,10/1/2004,"MD",,,,7768
4463672,4187141,"I",72,,"4463672-1",20040707,7/7/2004,20040922,9/22/2004,20041001,10/1/2004,"EXP",698880,"JP-JNJFOC-20040704083","CENTOCOR, INC.",,,"M","Y",52,"KG",20041001,10/1/2004,"MD",,,,7768
4463701,4219787,"I",72,,"4463701-5",,,20040923,9/23/2004,20041001,10/1/2004,"EXP",698880,"US-JNJFOC-20040908884","JOHNSON + JOHNSON PHARMACEUTICAL",31,"YR",,"Y",,,20041001,10/1/2004,"MD",,,,7768
4463707,4219789,"I",72,,"4463707-6",,,20040918,9/18/2004,20041001,10/1/2004,"EXP",698880,"US-JNJFOC-20040906958","JOHNSON + JOHNSON PHARMACEUTICAL",,,"F","Y",,,20041001,10/1/2004,"CN",,,,6778
4463724,4189907,"I",72,,"4463724-6",20040804,8/4/2004,20040928,9/28/2004,20041001,10/1/2004,"EXP",698880,"US-JNJFOC-20040801370","JOHNSON + JOHNSON PHARMACEUTICAL",,,"F","Y",51.2599983215332,"KG",20041001,10/1/2004,"MD",20040804,,,7768
4463727,3932864,"F",70,,"4463727-1",20030210,2/10/2003,20030411,4/11/2003,20041001,10/1/2004,"EXP",698880,"US-BRISTOL-MYERS SQUIBB COMPANY-12238242","BRISTOL-MYERS SQUIBB COMPANY",61,"YR","M","Y",,,20041001,10/1/2004,"MD",,,,7768
4463728,3782389,"F",70,,"4463728-3",20000403,4/3/2000,20000606,6/6/2000,20041001,10/1/2004,"EXP",698880,"10409357","BRISTOL-MYERS SQUIBB COMPANY",23,"YR","F","Y",,,20041001,10/1/2004,"OT",,,,7984
4463733,4219801,"I",72,,"4463733-7",20040907,9/7/2004,20040924,9/24/2004,20041001,10/1/2004,"EXP",698880,"US-BRISTOL-MYERS SQUIBB COMPANY-12711727","BRISTOL-MYERS SQUIBB COMPANY",35,"YR","M","Y",,,20041001,10/1/2004,"OT",,,,7984
4463756,4219815,"I",72,,"4463756-8",,,20040921,9/21/2004,20041001,10/1/2004,"EXP",698880,"US-BRISTOL-MYERS SQUIBB COMPANY-12708376","BRISTOL-MYERS SQUIBB COMPANY",64,"YR","F","Y",,,20041001,10/1/2004,"PH",,,,8072
4463761,4037391,"F",70,,"4463761-1",20030522,5/22/2003,20031119,11/19/2003,20041001,10/1/2004,"EXP",698880,"PHBS2003JP12939","NOVARTIS PHARMACEUTICALS CORP.",42,"YR","F","Y",,,20040930,9/30/2004,,,,,
4463775,4199256,"F",70,,"4463775-1",,,20040825,8/25/2004,20041001,10/1/2004,"EXP",698880,"PHHO2004PE11938","NOVARTIS PHARMACEUTICALS CORP.",35,"YR","M","Y",,,20040930,9/30/2004,"MD",20040731,,,7768
4463784,4115570,"I",72,,"4463784-2",20031002,10/2/2003,20040921,9/21/2004,20041001,10/1/2004,"EXP",698880,"CA-JNJFOC-20040302321","JOHNSON + JOHNSON PHARMACEUTICAL",15,"YR","F","Y",,,20041001,10/1/2004,"CN",,,,6778
4463785,4112619,"I",72,,"4463785-4",20040106,1/6/2004,20040921,9/21/2004,20041001,10/1/2004,"EXP",698880,"CA-JNJFOC-20040301625","JOHNSON + JOHNSON PHARMACEUTICAL",,,"M","Y",,,20041001,10/1/2004,"MD",20040107,,,7768
4463786,4219830,"I",72,,"4463786-6",,,20040921,9/21/2004,20041001,10/1/2004,"EXP",698880,"JP-JNJFOC-20040908769","JOHNSON + JOHNSON PHARMACEUTICAL",,,"F","Y",,,20041001,10/1/2004,"MD",,,,7768
4463787,4219831,"F",70,,"4463787-8",20040901,9/1/2004,20040827,8/27/2004,20041001,10/1/2004,"EXP",698880,"GB-JNJFOC-20040900021","JOHNSON + JOHNSON PHARMACEUTICAL",,,"M","Y",55,"KG",20041001,10/1/2004,"MD",,,,7768
4463788,4219832,"I",72,,"4463788-X",,,20040922,9/22/2004,20041001,10/1/2004,"EXP",698880,"NL-JNJFOC-20040907060","JOHNSON + JOHNSON PHARMACEUTICAL",,,"M","Y",,,20041001,10/1/2004,"PH",,,,8072
4463789,4219833,"I",72,,"4463789-1",20040901,9/1/2004,20040927,9/27/2004,20041001,10/1/2004,"EXP",698880,"BE-JNJFOC-20040908977","JOHNSON + JOHNSON PHARMACEUTICAL",4,"MON","M","Y",,,20041001,10/1/2004,"MD",,,,7768
4463790,4219834,"I",72,,"4463790-8",,,20040928,9/28/2004,20041001,10/1/2004,"EXP",698880,"BE-JNJFOC-20040909777","JOHNSON + JOHNSON PHARMACEUTICAL",44,"YR","F","Y",,,20041001,10/1/2004,"MD",20040925,,,7768
4463791,4191859,"I",72,,"4463791-X",20031101,11/1/2003,20040929,9/29/2004,20041001,10/1/2004,"PER",806982,"FR-JNJFOC-20040800179","JOHNSON + JOHNSON PHARMACEUTICAL",,,"M","Y",,,20041001,10/1/2004,"MD",,,,7768
4463792,4219835,"I",72,,"4463792-1",,,20040930,9/30/2004,20041001,10/1/2004,"EXP",698880,"BE-JNJFOC-20041000014","JOHNSON + JOHNSON PHARMACEUTICAL",66,"YR","F","Y",,,20041001,10/1/2004,"MD",,,,7768
4463799,4199263,"F",70,,"4463799-4",20040821,8/21/2004,20040825,8/25/2004,20041001,10/1/2004,"EXP",698880,"PHHO2004PE11936","NOVARTIS PHARMACEUTICALS CORP.",85,"YR","M","Y",,,20040930,9/30/2004,"MD",,,,7768
4463801,3311816,"F",70,,"4463801-X",19990610,6/10/1999,19990702,7/2/1999,20041001,10/1/2004,"EXP",698880,"199920009DDC","AVENTIS PHARMACEUTICALS, INC.",,,"M","Y",,,20041001,10/1/2004,,19990615,,,
4463802,4219841,"I",72,,"4463802-1",20040615,6/15/2004,20040813,8/13/2004,20041001,10/1/2004,"EXP",698880,"200412707JP","AVENTIS PHARMACEUTICALS, INC.",65,"YR","M","Y",68,"KG",20041001,10/1/2004,"MD",,,,7768
4463803,4219842,"I",72,,"4463803-3",20040919,9/19/2004,20040920,9/20/2004,20041001,10/1/2004,"EXP",698880,"200417165US","AVENTIS PHARMACEUTICALS, INC.",26,"YR","F","Y",,,20041001,10/1/2004,"OT",,,,7984
4463804,4219843,"I",72,,"4463804-5",20040725,7/25/2004,20040924,9/24/2004,20041001,10/1/2004,"EXP",698880,"200412909EU","AVENTIS PHARMACEUTICALS, INC.",57,"YR","F","Y",,,20041001,10/1/2004,"MD",,,,7768
4463805,4219844,"I",72,,"4463805-7",20040913,9/13/2004,20040927,9/27/2004,20041001,10/1/2004,"EXP",698880,"200417335US","AVENTIS PHARMACEUTICALS, INC.",,,"F","Y",,,20041001,10/1/2004,"MD",,,,7768
4463806,4208098,"I",72,,"4463806-9",,,20040902,9/2/2004,20041001,10/1/2004,"EXP",698880,"200418838GDDC","AVENTIS PHARMACEUTICALS, INC.",74,"YR","M","Y",,,20041001,10/1/2004,,,,,
4463807,4219845,"I",72,,"4463807-0",20040829,8/29/2004,20040922,9/22/2004,20041001,10/1/2004,"EXP",698880,"200413530FR","AVENTIS PHARMACEUTICALS, INC.",70,"YR","M","Y",,,20041001,10/1/2004,,,,,
4463808,4219846,"I",72,,"4463808-2",20040915,9/15/2004,20040921,9/21/2004,20041001,10/1/2004,"EXP",698880,"PHHO2004US13271","NOVARTIS PHARMACEUTICALS CORP.",70,"YR","M","Y",121,"KG",20040930,9/30/2004,"MD",,,,7768
4463822,4219860,"I",72,,"4463822-7",20040915,9/15/2004,20040921,9/21/2004,20041001,10/1/2004,"EXP",698880,"IN-JNJFOC-20040907823","JOHNSON + JOHNSON PHARMACEUTICAL",60,"YR","F","Y",,,20041001,10/1/2004,"MD",,,,7768
4463835,4219941,"I",72,,"4463835-5",,,,,20041001,10/1/2004,"DIR",687382,,,50,"YR","F","N",160,"LBS",20040930,9/30/2004,"CN",,"N","N",6778
4463838,4219869,"I",72,,"4463838-0",20040922,9/22/2004,20040928,9/28/2004,20041001,10/1/2004,"EXP",698880,"PHBS2004RO12814","NOVARTIS PHARMACEUTICALS CORP.",62,"YR","M","Y",75,"KG",20040930,9/30/2004,"MD",,,,7768
4463845,4206973,"F",70,,"4463845-8",20040726,7/26/2004,20040903,9/3/2004,20041001,10/1/2004,"EXP",698880,"PHBS2004JP11791","NOVARTIS PHARMACEUTICALS CORP.",82,"YR","M","Y",,,20041001,10/1/2004,"MD",20040910,,,7768
4463871,4219892,"I",72,,"4463871-9",,,20040929,9/29/2004,20041001,10/1/2004,"EXP",698880,"PHFR2004GB03621","NOVARTIS PHARMACEUTICALS CORP.",,,,"Y",,,20041001,10/1/2004,"MD",,,,7768
4463883,4219902,"I",72,,"4463883-5",,,20040923,9/23/2004,20041001,10/1/2004,"EXP",698880,"US-JNJFOC-20040908653","JOHNSON + JOHNSON PHARMACEUTICAL",20,"YR",,"Y",,,20041001,10/1/2004,"MD",,,,7768
4463884,4219903,"I",72,,"4463884-7",,,20040923,9/23/2004,20041001,10/1/2004,"EXP",698880,"US-JNJFOC-20040908818","JOHNSON + JOHNSON PHARMACEUTICAL",65,"YR",,"Y",,,20041001,10/1/2004,"MD",,,,7768
4463885,4219904,"I",72,,"4463885-9",,,20040923,9/23/2004,20041001,10/1/2004,"EXP",698880,"US-JNJFOC-20040908820","JOHNSON + JOHNSON PHARMACEUTICAL",35,"YR",,"Y",,,20041001,10/1/2004,"MD",,,,7768
4463886,4219905,"I",72,,"4463886-0",,,20040923,9/23/2004,20041001,10/1/2004,"EXP",698880,"US-JNJFOC-20040908821","JOHNSON + JOHNSON PHARMACEUTICAL",41,"YR",,"Y",,,20041001,10/1/2004,"MD",,,,7768
4463887,4219906,"I",72,,"4463887-2",,,20040923,9/23/2004,20041001,10/1/2004,"EXP",698880,"US-JNJFOC-20040908822","JOHNSON + JOHNSON PHARMACEUTICAL",53,"YR",,"Y",,,20041001,10/1/2004,"MD",,,,7768
4463888,4219907,"I",72,,"4463888-4",,,20040923,9/23/2004,20041001,10/1/2004,"EXP",698880,"US-JNJFOC-20040908823","JOHNSON + JOHNSON PHARMACEUTICAL",55,"YR",,"Y",,,20041001,10/1/2004,"MD",,,,7768
4463889,4219908,"I",72,,"4463889-6",,,20040923,9/23/2004,20041001,10/1/2004,"EXP",698880,"US-JNJFOC-20040908824","JOHNSON + JOHNSON PHARMACEUTICAL",25,"YR",,"Y",,,20041001,10/1/2004,"MD",,,,7768
4463900,4219913,"I",72,,"4463900-2",,,20040923,9/23/2004,20041001,10/1/2004,"EXP",698880,"US-JNJFOC-20040908834","JOHNSON + JOHNSON PHARMACEUTICAL",52,"YR",,"Y",,,20041001,10/1/2004,"MD",,,,7768
4463906,4207983,"F",70,,"4463906-3",20040101,1/1/2004,20040901,9/1/2004,20041001,10/1/2004,"EXP",698880,"200418829GDDC","AVENTIS PHARMACEUTICALS, INC.",34,"YR","F","Y",,,20041001,10/1/2004,"MD",,,,7768
4463907,4211550,"F",70,,"4463907-5",20040719,7/19/2004,20040805,8/5/2004,20041001,10/1/2004,"EXP",698880,"200415956US","AVENTIS PHARMACEUTICALS, INC.",,,"F","Y",51.7999992370605,"KG",20041001,10/1/2004,,,,,
4463915,4219925,"I",72,,"4463915-4",20030801,8/1/2003,20040920,9/20/2004,20041001,10/1/2004,"EXP",698880,"FR-AMGEN-UK091981","AMGEN",73,"YR","F","Y",,,20040930,9/30/2004,"OT",,,,7984
4463918,4197724,"F",70,,"4463918-X",20040625,6/25/2004,20040819,8/19/2004,20041001,10/1/2004,"EXP",698880,"US-AMGEN-US087842","AMGEN",74,"YR","F","Y",,,20040930,9/30/2004,"OT",,,,7984
4463920,4153001,"F",70,,"4463920-8",20040113,1/13/2004,20040603,6/3/2004,20041001,10/1/2004,"EXP",698880,"US-AMGEN-US079053","AMGEN",80,"YR","M","Y",,,20040930,9/30/2004,"MD",,,,7768
4463921,4219931,"I",72,,"4463921-X",20030101,1/1/2003,20040921,9/21/2004,20041001,10/1/2004,"EXP",698880,"US-JNJFOC-20040907183","JOHNSON + JOHNSON PHARMACEUTICAL",54,"YR","F","Y",,,20041001,10/1/2004,"CN",,,,6778
4463933,4218277,"F",70,,"4463933-6",20040101,1/1/2004,20040920,9/20/2004,20041001,10/1/2004,"EXP",698880,"FRWYE858828JUN04","AMGEN",,,"M","Y",92,"KG",20040930,9/30/2004,"OT",,,,7984
4463934,4189918,"F",70,,"4463934-8",20040727,7/27/2004,20040803,8/3/2004,20041001,10/1/2004,"EXP",698880,"US-AMGEN-US086000","AMGEN",,,"M","Y",,,20040930,9/30/2004,"MD",,,,7768
4463935,4219939,"F",70,,"4463935-X",20031001,10/1/2003,20040901,9/1/2004,20041001,10/1/2004,"EXP",698880,"US-AMGEN-US089703","AMGEN",,,"F","Y",,,20040930,9/30/2004,"OT",,,,7984
4463942,4219944,"I",72,,"4463942-7",20040920,9/20/2004,20040921,9/21/2004,20041001,10/1/2004,"EXP",698880,"GBWYE057622SEP04","AMGEN",,,"F","Y",,,20040930,9/30/2004,"OT",,,,7984
4463943,4219945,"I",72,,"4463943-9",20040701,7/1/2004,20040923,9/23/2004,20041001,10/1/2004,"EXP",698880,"US-AMGEN-US092787","AMGEN",,,"F","Y",,,20040930,9/30/2004,"CN",20040826,,,6778
4463944,4197856,"F",70,,"4463944-0",20040319,3/19/2004,20040819,8/19/2004,20041001,10/1/2004,"EXP",698880,"DEWYE989719AUG04","AMGEN",68,"YR","F","Y",,,20040930,9/30/2004,"MD",,,,7768
4463954,4219947,"I",72,,"4463954-3",20040813,8/13/2004,20040818,8/18/2004,20041001,10/1/2004,"EXP",698880,"US-AMGEN-US087660","AMGEN",,,"F","Y",49.5,"KG",20040930,9/30/2004,,,,,
4463955,4219952,"I",72,,"4463955-5",20040101,1/1/2004,20040922,9/22/2004,20041001,10/1/2004,"EXP",698880,"ES-BRISTOL-MYERS SQUIBB COMPANY-12710851","BRISTOL-MYERS SQUIBB COMPANY",,,"M","Y",,,20041001,10/1/2004,"MD",20040101,,,7768
4463956,4219953,"I",72,,"4463956-7",20040901,9/1/2004,20040924,9/24/2004,20041001,10/1/2004,"EXP",698880,"US-BRISTOL-MYERS SQUIBB COMPANY-12711628","BRISTOL-MYERS SQUIBB COMPANY",50,"YR","F","Y",67,"KG",20041001,10/1/2004,"OT",,,,7984
4463957,4206431,"F",70,,"4463957-9",,,20040902,9/2/2004,20041001,10/1/2004,"EXP",698880,"US-BRISTOL-MYERS SQUIBB COMPANY-12691176","BRISTOL-MYERS SQUIBB COMPANY",59,"YR","M","Y",,,20041001,10/1/2004,"OT",20040829,,,7984
4463958,4168988,"F",70,,"4463958-0",20030101,1/1/2003,20040708,7/8/2004,20041001,10/1/2004,"EXP",698880,"US-BRISTOL-MYERS SQUIBB COMPANY-12635355","BRISTOL-MYERS SQUIBB COMPANY",81,"YR","F","Y",77,"KG",20041001,10/1/2004,"OT",,,,7984
4463959,4211612,"F",70,,"4463959-2",20040819,8/19/2004,20040908,9/8/2004,20041001,10/1/2004,"EXP",698880,"JP-BRISTOL-MYERS SQUIBB COMPANY-12698882","BRISTOL-MYERS SQUIBB COMPANY",54,"YR","F","Y",,,20041001,10/1/2004,"MD",20040821,,,7768
4463960,4219954,"I",72,,"4463960-9",,,20040928,9/28/2004,20041001,10/1/2004,"EXP",698880,"ES-BRISTOL-MYERS SQUIBB COMPANY-12713749","BRISTOL-MYERS SQUIBB COMPANY",31,"YR","M","Y",,,20041001,10/1/2004,"OT",20040922,,,7984
4463963,4219956,"I",72,,"4463963-4",20040908,9/8/2004,20040924,9/24/2004,20041001,10/1/2004,"EXP",698880,"200412902EU","AVENTIS PHARMACEUTICALS, INC.",65,"YR","M","Y",,,20041001,10/1/2004,"MD",20040917,,,7768